{"text_format":"1","workbook":"xlsx","n_sheets":4,"sheets":["Luca73","Marius44","ninai","Toty"],"not_rendered":{"charts":0,"images":0,"macros":1,"external_links":0,"defined_names":5,"comments":0,"pivot_tables":0},"unopened":[],"bounds":{"document_bytes":16777216,"sheet_cells":100000,"rows_first":2000,"rows_last":500,"rows_between":2000,"halvings":0,"cell_chars":16384,"cell_head_chars":4096},"cells_cut":0,"cells_raw":0,"read":"whole","date_system":"1900"}

{"sheet":"Luca73","index":0,"n_rows":64,"n_cols":15,"rows_kept":64,"cut":false,"hidden":false,"merged":[]}
[null,"TABELLA ARTICOLI PRELEVATI NEL 2014 DAI DIVERSI MAGAZZINI",null,null,null,null,null,null,null,"TABELLA ARTICOLI PRELEVATI NEL 2014 E SUDDIVISI PER TRIMESTRE"]
[]
[null,"COD. ART.","DESCRIZIONE ARTICOLO","SEDE","Q.TA' prelevata","DATA",null,null,null,"SELEZIONARE IL MAGAZZINO : ","Milano"]
[null,"KWO-343/SK","VITI TCCEI 12.9 UNI 5931 BR. M20 X 140","Brescia",18,"2014-01-15"]
[null,"SGY-295/PG","PIGNONE SEMPL. 3/4 Z9\"","Milano",10,"2014-01-18",null,null,null,"Elenco Univoco Articoli","I° TRIM.","II° TRIM.","III° TRIM.","IV° TRIM","TOTALE"]
[null,"QBI-332/YQ","FORCELLA FEMMINA CON SNODO SGS/M16X1.5","Roma",6,"2014-01-25",null,null,null,{"$f":"B4","v":"KWO-343/SK"},{"$f":"SUM($E$4:$E$64*($B$4:$B$64=J6)*(IF($K$3=\"Tutti\",1,$D$4:$D$64=$K$3))*($F$4:$F$64>=DATE(2014,1,1))*($F$4:$F$64<DATE(2014,4,1)))","v":0},{"$f":"SUMIFS($E$4:$E$64,$D$4:$D$64,IF($K$3=\"Tutti\",\"*\",$K$3),$B$4:$B$64,J6,$F$4:$F$64,\">=\"&DATE(2014,4,1),$F$4:$F$64,\"<\"&DATE(2014,7,1))","v":0},{"$f":"SUMPRODUCT($E$4:$E$64,IF($B$4:$B$64=J6,1,0),IF($D$4:$D$64=$K$3,1,IF($K$3=\"Tutti\",1,0)),IF($F$4:$F$64>=DATE(2014,7,1),1,0),IF($F$4:$F$64<DATE(2014,10,1),1,0))","v":0},{"$f":"SUM($E$4:$E$64*IF($B$4:$B$64=J6,1,0)*IF($D$4:$D$64=$K$3,1,$K$3=\"Tutti\")*IF($F$4:$F$64>=DATE(2014,10,1),1,0))","v":18},{"$f":"SUM(K6:N6)","v":18}]
[null,"RVG-263/JX","SERVOVALVOLA CON ROTORE DINAMICO","Firenze",4,"2014-02-01",null,null,null,{"$f":"IF(SUM(COUNTIF($B$4:$B$64,$J$6:J6))=COUNTA($B$4:$B$64),\"\",OFFSET($B$1,MIN(IF(COUNTIF($J$6:J6,$B$4:$B$64)=0,ROW($B$4:$B$64),COUNTA($B$4:$B$64))-1),0))","v":"SGY-295/PG"},{"$f":"SUM($E$4:$E$64*($B$4:$B$64=J7)*(IF($K$3=\"Tutti\",1,$D$4:$D$64=$K$3))*($F$4:$F$64>=DATE(2014,1,1))*($F$4:$F$64<DATE(2014,4,1)))","v":10},{"$f":"SUMIFS($E$4:$E$64,$D$4:$D$64,IF($K$3=\"Tutti\",\"*\",$K$3),$B$4:$B$64,J7,$F$4:$F$64,\">=\"&DATE(2014,4,1),$F$4:$F$64,\"<\"&DATE(2014,7,1))","v":0},{"$f":"SUMPRODUCT($E$4:$E$64,IF($B$4:$B$64=J7,1,0),IF($D$4:$D$64=$K$3,1,IF($K$3=\"Tutti\",1,0)),IF($F$4:$F$64>=DATE(2014,7,1),1,0),IF($F$4:$F$64<DATE(2014,10,1),1,0))","v":0},{"$f":"SUM($E$4:$E$64*IF($B$4:$B$64=J7,1,0)*IF($D$4:$D$64=$K$3,1,$K$3=\"Tutti\")*IF($F$4:$F$64>=DATE(2014,10,1),1,0))","v":0},{"$f":"SUM(K7:N7)","v":10}]
[null,"SGY-295/PG","PIGNONE SEMPL. 3/4 Z9\"","Roma",6,"2014-02-09",null,null,null,{"$f":"IF(SUM(COUNTIF($B$4:$B$64,$J$6:J7))=COUNTA($B$4:$B$64),\"\",OFFSET($B$1,MIN(IF(COUNTIF($J$6:J7,$B$4:$B$64)=0,ROW($B$4:$B$64),COUNTA($B$4:$B$64))-1),0))","v":"QBI-332/YQ"},{"$f":"SUM($E$4:$E$64*($B$4:$B$64=J8)*(IF($K$3=\"Tutti\",1,$D$4:$D$64=$K$3))*($F$4:$F$64>=DATE(2014,1,1))*($F$4:$F$64<DATE(2014,4,1)))","v":0},{"$f":"SUMIFS($E$4:$E$64,$D$4:$D$64,IF($K$3=\"Tutti\",\"*\",$K$3),$B$4:$B$64,J8,$F$4:$F$64,\">=\"&DATE(2014,4,1),$F$4:$F$64,\"<\"&DATE(2014,7,1))","v":0},{"$f":"SUMPRODUCT($E$4:$E$64,IF($B$4:$B$64=J8,1,0),IF($D$4:$D$64=$K$3,1,IF($K$3=\"Tutti\",1,0)),IF($F$4:$F$64>=DATE(2014,7,1),1,0),IF($F$4:$F$64<DATE(2014,10,1),1,0))","v":0},{"$f":"SUM($E$4:$E$64*IF($B$4:$B$64=J8,1,0)*IF($D$4:$D$64=$K$3,1,$K$3=\"Tutti\")*IF($F$4:$F$64>=DATE(2014,10,1),1,0))","v":0},0]
[null,"OQJ-149/CP","KIT COMPLETO GUARNIZIONI CILINDRO 125","Firenze",10,"2014-02-11",null,null,null,{"$f":"IF(SUM(COUNTIF($B$4:$B$64,$J$6:J8))=COUNTA($B$4:$B$64),\"\",OFFSET($B$1,MIN(IF(COUNTIF($J$6:J8,$B$4:$B$64)=0,ROW($B$4:$B$64),COUNTA($B$4:$B$64))-1),0))","v":"RVG-263/JX"},{"$f":"SUM($E$4:$E$64*($B$4:$B$64=J9)*(IF($K$3=\"Tutti\",1,$D$4:$D$64=$K$3))*($F$4:$F$64>=DATE(2014,1,1))*($F$4:$F$64<DATE(2014,4,1)))","v":0},{"$f":"SUMIFS($E$4:$E$64,$D$4:$D$64,IF($K$3=\"Tutti\",\"*\",$K$3),$B$4:$B$64,J9,$F$4:$F$64,\">=\"&DATE(2014,4,1),$F$4:$F$64,\"<\"&DATE(2014,7,1))","v":0},{"$f":"SUMPRODUCT($E$4:$E$64,IF($B$4:$B$64=J9,1,0),IF($D$4:$D$64=$K$3,1,IF($K$3=\"Tutti\",1,0)),IF($F$4:$F$64>=DATE(2014,7,1),1,0),IF($F$4:$F$64<DATE(2014,10,1),1,0))","v":16},{"$f":"SUM($E$4:$E$64*IF($B$4:$B$64=J9,1,0)*IF($D$4:$D$64=$K$3,1,$K$3=\"Tutti\")*IF($F$4:$F$64>=DATE(2014,10,1),1,0))","v":0},16]
[null,"GTN-188/OI","VALVOLA RITEGNO A PIASTRA Z1S 10 P2-3X/V","Roma",4,"2014-02-16",null,null,null,{"$f":"IF(SUM(COUNTIF($B$4:$B$64,$J$6:J9))=COUNTA($B$4:$B$64),\"\",OFFSET($B$1,MIN(IF(COUNTIF($J$6:J9,$B$4:$B$64)=0,ROW($B$4:$B$64),COUNTA($B$4:$B$64))-1),0))","v":"OQJ-149/CP"},{"$f":"SUM($E$4:$E$64*($B$4:$B$64=J10)*(IF($K$3=\"Tutti\",1,$D$4:$D$64=$K$3))*($F$4:$F$64>=DATE(2014,1,1))*($F$4:$F$64<DATE(2014,4,1)))","v":0},{"$f":"SUMIFS($E$4:$E$64,$D$4:$D$64,IF($K$3=\"Tutti\",\"*\",$K$3),$B$4:$B$64,J10,$F$4:$F$64,\">=\"&DATE(2014,4,1),$F$4:$F$64,\"<\"&DATE(2014,7,1))","v":0},{"$f":"SUMPRODUCT($E$4:$E$64,IF($B$4:$B$64=J10,1,0),IF($D$4:$D$64=$K$3,1,IF($K$3=\"Tutti\",1,0)),IF($F$4:$F$64>=DATE(2014,7,1),1,0),IF($F$4:$F$64<DATE(2014,10,1),1,0))","v":0},{"$f":"SUM($E$4:$E$64*IF($B$4:$B$64=J10,1,0)*IF($D$4:$D$64=$K$3,1,$K$3=\"Tutti\")*IF($F$4:$F$64>=DATE(2014,10,1),1,0))","v":0},0]
[null,"KWO-343/SK","VITI TCCEI 12.9 UNI 5931 BR. M20 X 140","Brescia",12,"2014-02-23",null,null,null,{"$f":"IF(SUM(COUNTIF($B$4:$B$64,$J$6:J10))=COUNTA($B$4:$B$64),\"\",OFFSET($B$1,MIN(IF(COUNTIF($J$6:J10,$B$4:$B$64)=0,ROW($B$4:$B$64),COUNTA($B$4:$B$64))-1),0))","v":"GTN-188/OI"},{"$f":"SUM($E$4:$E$64*($B$4:$B$64=J11)*(IF($K$3=\"Tutti\",1,$D$4:$D$64=$K$3))*($F$4:$F$64>=DATE(2014,1,1))*($F$4:$F$64<DATE(2014,4,1)))","v":0},{"$f":"SUMIFS($E$4:$E$64,$D$4:$D$64,IF($K$3=\"Tutti\",\"*\",$K$3),$B$4:$B$64,J11,$F$4:$F$64,\">=\"&DATE(2014,4,1),$F$4:$F$64,\"<\"&DATE(2014,7,1))","v":0},{"$f":"SUMPRODUCT($E$4:$E$64,IF($B$4:$B$64=J11,1,0),IF($D$4:$D$64=$K$3,1,IF($K$3=\"Tutti\",1,0)),IF($F$4:$F$64>=DATE(2014,7,1),1,0),IF($F$4:$F$64<DATE(2014,10,1),1,0))","v":16},{"$f":"SUM($E$4:$E$64*IF($B$4:$B$64=J11,1,0)*IF($D$4:$D$64=$K$3,1,$K$3=\"Tutti\")*IF($F$4:$F$64>=DATE(2014,10,1),1,0))","v":0},16]
[null,"IAB-347/TY","REGOLATORE DI FLUSSO Z2FS 10-3-3 X/ V","Roma",4,"2014-03-01",null,null,null,{"$f":"IF(SUM(COUNTIF($B$4:$B$64,$J$6:J11))=COUNTA($B$4:$B$64),\"\",OFFSET($B$1,MIN(IF(COUNTIF($J$6:J11,$B$4:$B$64)=0,ROW($B$4:$B$64),COUNTA($B$4:$B$64))-1),0))","v":"IAB-347/TY"},{"$f":"SUM($E$4:$E$64*($B$4:$B$64=J12)*(IF($K$3=\"Tutti\",1,$D$4:$D$64=$K$3))*($F$4:$F$64>=DATE(2014,1,1))*($F$4:$F$64<DATE(2014,4,1)))","v":0},{"$f":"SUMIFS($E$4:$E$64,$D$4:$D$64,IF($K$3=\"Tutti\",\"*\",$K$3),$B$4:$B$64,J12,$F$4:$F$64,\">=\"&DATE(2014,4,1),$F$4:$F$64,\"<\"&DATE(2014,7,1))","v":0},{"$f":"SUMPRODUCT($E$4:$E$64,IF($B$4:$B$64=J12,1,0),IF($D$4:$D$64=$K$3,1,IF($K$3=\"Tutti\",1,0)),IF($F$4:$F$64>=DATE(2014,7,1),1,0),IF($F$4:$F$64<DATE(2014,10,1),1,0))","v":0},{"$f":"SUM($E$4:$E$64*IF($B$4:$B$64=J12,1,0)*IF($D$4:$D$64=$K$3,1,$K$3=\"Tutti\")*IF($F$4:$F$64>=DATE(2014,10,1),1,0))","v":0},0]
[null,"SGY-295/PG","PIGNONE SEMPL. 3/4 Z9\"","Firenze",6,"2014-03-05",null,null,null,{"$f":"IF(SUM(COUNTIF($B$4:$B$64,$J$6:J12))=COUNTA($B$4:$B$64),\"\",OFFSET($B$1,MIN(IF(COUNTIF($J$6:J12,$B$4:$B$64)=0,ROW($B$4:$B$64),COUNTA($B$4:$B$64))-1),0))","v":"OYZ-311/GH"},{"$f":"SUM($E$4:$E$64*($B$4:$B$64=J13)*(IF($K$3=\"Tutti\",1,$D$4:$D$64=$K$3))*($F$4:$F$64>=DATE(2014,1,1))*($F$4:$F$64<DATE(2014,4,1)))","v":0},{"$f":"SUMIFS($E$4:$E$64,$D$4:$D$64,IF($K$3=\"Tutti\",\"*\",$K$3),$B$4:$B$64,J13,$F$4:$F$64,\">=\"&DATE(2014,4,1),$F$4:$F$64,\"<\"&DATE(2014,7,1))","v":0},{"$f":"SUMPRODUCT($E$4:$E$64,IF($B$4:$B$64=J13,1,0),IF($D$4:$D$64=$K$3,1,IF($K$3=\"Tutti\",1,0)),IF($F$4:$F$64>=DATE(2014,7,1),1,0),IF($F$4:$F$64<DATE(2014,10,1),1,0))","v":0},{"$f":"SUM($E$4:$E$64*IF($B$4:$B$64=J13,1,0)*IF($D$4:$D$64=$K$3,1,$K$3=\"Tutti\")*IF($F$4:$F$64>=DATE(2014,10,1),1,0))","v":0},0]
[null,"OYZ-311/GH","COPERCHIO ELEMENTO LOGICO LFA 25 KWA-7X/","Firenze",4,"2014-03-10",null,null,null,{"$f":"IF(SUM(COUNTIF($B$4:$B$64,$J$6:J13))=COUNTA($B$4:$B$64),\"\",OFFSET($B$1,MIN(IF(COUNTIF($J$6:J13,$B$4:$B$64)=0,ROW($B$4:$B$64),COUNTA($B$4:$B$64))-1),0))","v":"DBY-128/GN"},{"$f":"SUM($E$4:$E$64*($B$4:$B$64=J14)*(IF($K$3=\"Tutti\",1,$D$4:$D$64=$K$3))*($F$4:$F$64>=DATE(2014,1,1))*($F$4:$F$64<DATE(2014,4,1)))","v":0},{"$f":"SUMIFS($E$4:$E$64,$D$4:$D$64,IF($K$3=\"Tutti\",\"*\",$K$3),$B$4:$B$64,J14,$F$4:$F$64,\">=\"&DATE(2014,4,1),$F$4:$F$64,\"<\"&DATE(2014,7,1))","v":0},{"$f":"SUMPRODUCT($E$4:$E$64,IF($B$4:$B$64=J14,1,0),IF($D$4:$D$64=$K$3,1,IF($K$3=\"Tutti\",1,0)),IF($F$4:$F$64>=DATE(2014,7,1),1,0),IF($F$4:$F$64<DATE(2014,10,1),1,0))","v":0},{"$f":"SUM($E$4:$E$64*IF($B$4:$B$64=J14,1,0)*IF($D$4:$D$64=$K$3,1,$K$3=\"Tutti\")*IF($F$4:$F$64>=DATE(2014,10,1),1,0))","v":0},0]
[null,"DBY-128/GN","AMMONIACA ANIDRA UN BOMBOLA DA KG.25","Brescia",14,"2014-03-18",null,null,null,{"$f":"IF(SUM(COUNTIF($B$4:$B$64,$J$6:J14))=COUNTA($B$4:$B$64),\"\",OFFSET($B$1,MIN(IF(COUNTIF($J$6:J14,$B$4:$B$64)=0,ROW($B$4:$B$64),COUNTA($B$4:$B$64))-1),0))","v":"LCJ-304/BX"},{"$f":"SUM($E$4:$E$64*($B$4:$B$64=J15)*(IF($K$3=\"Tutti\",1,$D$4:$D$64=$K$3))*($F$4:$F$64>=DATE(2014,1,1))*($F$4:$F$64<DATE(2014,4,1)))","v":0},{"$f":"SUMIFS($E$4:$E$64,$D$4:$D$64,IF($K$3=\"Tutti\",\"*\",$K$3),$B$4:$B$64,J15,$F$4:$F$64,\">=\"&DATE(2014,4,1),$F$4:$F$64,\"<\"&DATE(2014,7,1))","v":10},{"$f":"SUMPRODUCT($E$4:$E$64,IF($B$4:$B$64=J15,1,0),IF($D$4:$D$64=$K$3,1,IF($K$3=\"Tutti\",1,0)),IF($F$4:$F$64>=DATE(2014,7,1),1,0),IF($F$4:$F$64<DATE(2014,10,1),1,0))","v":4},{"$f":"SUM($E$4:$E$64*IF($B$4:$B$64=J15,1,0)*IF($D$4:$D$64=$K$3,1,$K$3=\"Tutti\")*IF($F$4:$F$64>=DATE(2014,10,1),1,0))","v":0},14]
[null,"KWO-343/SK","VITI TCCEI 12.9 UNI 5931 BR. M20 X 140","Firenze",16,"2014-03-23",null,null,null,{"$f":"IF(SUM(COUNTIF($B$4:$B$64,$J$6:J15))=COUNTA($B$4:$B$64),\"\",OFFSET($B$1,MIN(IF(COUNTIF($J$6:J15,$B$4:$B$64)=0,ROW($B$4:$B$64),COUNTA($B$4:$B$64))-1),0))","v":"SYA-341/BM"},{"$f":"SUM($E$4:$E$64*($B$4:$B$64=J16)*(IF($K$3=\"Tutti\",1,$D$4:$D$64=$K$3))*($F$4:$F$64>=DATE(2014,1,1))*($F$4:$F$64<DATE(2014,4,1)))","v":0},{"$f":"SUMIFS($E$4:$E$64,$D$4:$D$64,IF($K$3=\"Tutti\",\"*\",$K$3),$B$4:$B$64,J16,$F$4:$F$64,\">=\"&DATE(2014,4,1),$F$4:$F$64,\"<\"&DATE(2014,7,1))","v":0},{"$f":"SUMPRODUCT($E$4:$E$64,IF($B$4:$B$64=J16,1,0),IF($D$4:$D$64=$K$3,1,IF($K$3=\"Tutti\",1,0)),IF($F$4:$F$64>=DATE(2014,7,1),1,0),IF($F$4:$F$64<DATE(2014,10,1),1,0))","v":0},{"$f":"SUM($E$4:$E$64*IF($B$4:$B$64=J16,1,0)*IF($D$4:$D$64=$K$3,1,$K$3=\"Tutti\")*IF($F$4:$F$64>=DATE(2014,10,1),1,0))","v":0},0]
[null,"LCJ-304/BX","KIT REVISIONE CILINDRO M.W.","Brescia",16,"2014-03-26",null,null,null,{"$f":"IF(SUM(COUNTIF($B$4:$B$64,$J$6:J16))=COUNTA($B$4:$B$64),\"\",OFFSET($B$1,MIN(IF(COUNTIF($J$6:J16,$B$4:$B$64)=0,ROW($B$4:$B$64),COUNTA($B$4:$B$64))-1),0))","v":"IGF-330/RW"},{"$f":"SUM($E$4:$E$64*($B$4:$B$64=J17)*(IF($K$3=\"Tutti\",1,$D$4:$D$64=$K$3))*($F$4:$F$64>=DATE(2014,1,1))*($F$4:$F$64<DATE(2014,4,1)))","v":0},{"$f":"SUMIFS($E$4:$E$64,$D$4:$D$64,IF($K$3=\"Tutti\",\"*\",$K$3),$B$4:$B$64,J17,$F$4:$F$64,\">=\"&DATE(2014,4,1),$F$4:$F$64,\"<\"&DATE(2014,7,1))","v":0},{"$f":"SUMPRODUCT($E$4:$E$64,IF($B$4:$B$64=J17,1,0),IF($D$4:$D$64=$K$3,1,IF($K$3=\"Tutti\",1,0)),IF($F$4:$F$64>=DATE(2014,7,1),1,0),IF($F$4:$F$64<DATE(2014,10,1),1,0))","v":0},{"$f":"SUM($E$4:$E$64*IF($B$4:$B$64=J17,1,0)*IF($D$4:$D$64=$K$3,1,$K$3=\"Tutti\")*IF($F$4:$F$64>=DATE(2014,10,1),1,0))","v":14},14]
[null,"SYA-341/BM","PIGNONI SEMPLICI 3/4 Z21","Roma",14,"2014-03-31",null,null,null,{"$f":"IF(SUM(COUNTIF($B$4:$B$64,$J$6:J17))=COUNTA($B$4:$B$64),\"\",OFFSET($B$1,MIN(IF(COUNTIF($J$6:J17,$B$4:$B$64)=0,ROW($B$4:$B$64),COUNTA($B$4:$B$64))-1),0))","v":"BVD-350/EJ"},{"$f":"SUM($E$4:$E$64*($B$4:$B$64=J18)*(IF($K$3=\"Tutti\",1,$D$4:$D$64=$K$3))*($F$4:$F$64>=DATE(2014,1,1))*($F$4:$F$64<DATE(2014,4,1)))","v":0},{"$f":"SUMIFS($E$4:$E$64,$D$4:$D$64,IF($K$3=\"Tutti\",\"*\",$K$3),$B$4:$B$64,J18,$F$4:$F$64,\">=\"&DATE(2014,4,1),$F$4:$F$64,\"<\"&DATE(2014,7,1))","v":4},{"$f":"SUMPRODUCT($E$4:$E$64,IF($B$4:$B$64=J18,1,0),IF($D$4:$D$64=$K$3,1,IF($K$3=\"Tutti\",1,0)),IF($F$4:$F$64>=DATE(2014,7,1),1,0),IF($F$4:$F$64<DATE(2014,10,1),1,0))","v":0},{"$f":"SUM($E$4:$E$64*IF($B$4:$B$64=J18,1,0)*IF($D$4:$D$64=$K$3,1,$K$3=\"Tutti\")*IF($F$4:$F$64>=DATE(2014,10,1),1,0))","v":0},4]
[null,"IGF-330/RW","RUOTE 65 SERIE RINFORZATA CON FRENO","Brescia",10,"2014-04-06",null,null,null,{"$f":"IF(SUM(COUNTIF($B$4:$B$64,$J$6:J18))=COUNTA($B$4:$B$64),\"\",OFFSET($B$1,MIN(IF(COUNTIF($J$6:J18,$B$4:$B$64)=0,ROW($B$4:$B$64),COUNTA($B$4:$B$64))-1),0))","v":"EVW-340/RN"},{"$f":"SUM($E$4:$E$64*($B$4:$B$64=J19)*(IF($K$3=\"Tutti\",1,$D$4:$D$64=$K$3))*($F$4:$F$64>=DATE(2014,1,1))*($F$4:$F$64<DATE(2014,4,1)))","v":0},{"$f":"SUMIFS($E$4:$E$64,$D$4:$D$64,IF($K$3=\"Tutti\",\"*\",$K$3),$B$4:$B$64,J19,$F$4:$F$64,\">=\"&DATE(2014,4,1),$F$4:$F$64,\"<\"&DATE(2014,7,1))","v":0},{"$f":"SUMPRODUCT($E$4:$E$64,IF($B$4:$B$64=J19,1,0),IF($D$4:$D$64=$K$3,1,IF($K$3=\"Tutti\",1,0)),IF($F$4:$F$64>=DATE(2014,7,1),1,0),IF($F$4:$F$64<DATE(2014,10,1),1,0))","v":0},{"$f":"SUM($E$4:$E$64*IF($B$4:$B$64=J19,1,0)*IF($D$4:$D$64=$K$3,1,$K$3=\"Tutti\")*IF($F$4:$F$64>=DATE(2014,10,1),1,0))","v":0},0]
[null,"BVD-350/EJ","CARTUCCIA FILTRO DA 8 MICRON","Milano",4,"2014-04-09",null,null,null,{"$f":"IF(SUM(COUNTIF($B$4:$B$64,$J$6:J19))=COUNTA($B$4:$B$64),\"\",OFFSET($B$1,MIN(IF(COUNTIF($J$6:J19,$B$4:$B$64)=0,ROW($B$4:$B$64),COUNTA($B$4:$B$64))-1),0))","v":"NWC-213/WR"},{"$f":"SUM($E$4:$E$64*($B$4:$B$64=J20)*(IF($K$3=\"Tutti\",1,$D$4:$D$64=$K$3))*($F$4:$F$64>=DATE(2014,1,1))*($F$4:$F$64<DATE(2014,4,1)))","v":0},{"$f":"SUMIFS($E$4:$E$64,$D$4:$D$64,IF($K$3=\"Tutti\",\"*\",$K$3),$B$4:$B$64,J20,$F$4:$F$64,\">=\"&DATE(2014,4,1),$F$4:$F$64,\"<\"&DATE(2014,7,1))","v":6},{"$f":"SUMPRODUCT($E$4:$E$64,IF($B$4:$B$64=J20,1,0),IF($D$4:$D$64=$K$3,1,IF($K$3=\"Tutti\",1,0)),IF($F$4:$F$64>=DATE(2014,7,1),1,0),IF($F$4:$F$64<DATE(2014,10,1),1,0))","v":0},{"$f":"SUM($E$4:$E$64*IF($B$4:$B$64=J20,1,0)*IF($D$4:$D$64=$K$3,1,$K$3=\"Tutti\")*IF($F$4:$F$64>=DATE(2014,10,1),1,0))","v":0},6]
[null,"EVW-340/RN","OLFLEX FD CLASSIC 810 CY 4G0,5","Firenze",8,"2014-04-16",null,null,null,{"$f":"IF(SUM(COUNTIF($B$4:$B$64,$J$6:J20))=COUNTA($B$4:$B$64),\"\",OFFSET($B$1,MIN(IF(COUNTIF($J$6:J20,$B$4:$B$64)=0,ROW($B$4:$B$64),COUNTA($B$4:$B$64))-1),0))","v":"WTT-322/YR"},{"$f":"SUM($E$4:$E$64*($B$4:$B$64=J21)*(IF($K$3=\"Tutti\",1,$D$4:$D$64=$K$3))*($F$4:$F$64>=DATE(2014,1,1))*($F$4:$F$64<DATE(2014,4,1)))","v":0},{"$f":"SUMIFS($E$4:$E$64,$D$4:$D$64,IF($K$3=\"Tutti\",\"*\",$K$3),$B$4:$B$64,J21,$F$4:$F$64,\">=\"&DATE(2014,4,1),$F$4:$F$64,\"<\"&DATE(2014,7,1))","v":14},{"$f":"SUMPRODUCT($E$4:$E$64,IF($B$4:$B$64=J21,1,0),IF($D$4:$D$64=$K$3,1,IF($K$3=\"Tutti\",1,0)),IF($F$4:$F$64>=DATE(2014,7,1),1,0),IF($F$4:$F$64<DATE(2014,10,1),1,0))","v":0},{"$f":"SUM($E$4:$E$64*IF($B$4:$B$64=J21,1,0)*IF($D$4:$D$64=$K$3,1,$K$3=\"Tutti\")*IF($F$4:$F$64>=DATE(2014,10,1),1,0))","v":0},14]
[null,"NWC-213/WR","KIT MAGNETE  M.W.","Milano",6,"2014-04-23",null,null,null,{"$f":"IF(SUM(COUNTIF($B$4:$B$64,$J$6:J21))=COUNTA($B$4:$B$64),\"\",OFFSET($B$1,MIN(IF(COUNTIF($J$6:J21,$B$4:$B$64)=0,ROW($B$4:$B$64),COUNTA($B$4:$B$64))-1),0))","v":"OCI-162/XK"},{"$f":"SUM($E$4:$E$64*($B$4:$B$64=J22)*(IF($K$3=\"Tutti\",1,$D$4:$D$64=$K$3))*($F$4:$F$64>=DATE(2014,1,1))*($F$4:$F$64<DATE(2014,4,1)))","v":0},{"$f":"SUMIFS($E$4:$E$64,$D$4:$D$64,IF($K$3=\"Tutti\",\"*\",$K$3),$B$4:$B$64,J22,$F$4:$F$64,\">=\"&DATE(2014,4,1),$F$4:$F$64,\"<\"&DATE(2014,7,1))","v":0},{"$f":"SUMPRODUCT($E$4:$E$64,IF($B$4:$B$64=J22,1,0),IF($D$4:$D$64=$K$3,1,IF($K$3=\"Tutti\",1,0)),IF($F$4:$F$64>=DATE(2014,7,1),1,0),IF($F$4:$F$64<DATE(2014,10,1),1,0))","v":0},{"$f":"SUM($E$4:$E$64*IF($B$4:$B$64=J22,1,0)*IF($D$4:$D$64=$K$3,1,$K$3=\"Tutti\")*IF($F$4:$F$64>=DATE(2014,10,1),1,0))","v":0},0]
[null,"WTT-322/YR","CURVA 45ｰ F.F. 1 ZINC.\"","Milano",14,"2014-04-30",null,null,null,{"$f":"IF(SUM(COUNTIF($B$4:$B$64,$J$6:J22))=COUNTA($B$4:$B$64),\"\",OFFSET($B$1,MIN(IF(COUNTIF($J$6:J22,$B$4:$B$64)=0,ROW($B$4:$B$64),COUNTA($B$4:$B$64))-1),0))","v":"HYM-126/TJ"},{"$f":"SUM($E$4:$E$64*($B$4:$B$64=J23)*(IF($K$3=\"Tutti\",1,$D$4:$D$64=$K$3))*($F$4:$F$64>=DATE(2014,1,1))*($F$4:$F$64<DATE(2014,4,1)))","v":0},{"$f":"SUMIFS($E$4:$E$64,$D$4:$D$64,IF($K$3=\"Tutti\",\"*\",$K$3),$B$4:$B$64,J23,$F$4:$F$64,\">=\"&DATE(2014,4,1),$F$4:$F$64,\"<\"&DATE(2014,7,1))","v":14},{"$f":"SUMPRODUCT($E$4:$E$64,IF($B$4:$B$64=J23,1,0),IF($D$4:$D$64=$K$3,1,IF($K$3=\"Tutti\",1,0)),IF($F$4:$F$64>=DATE(2014,7,1),1,0),IF($F$4:$F$64<DATE(2014,10,1),1,0))","v":0},{"$f":"SUM($E$4:$E$64*IF($B$4:$B$64=J23,1,0)*IF($D$4:$D$64=$K$3,1,$K$3=\"Tutti\")*IF($F$4:$F$64>=DATE(2014,10,1),1,0))","v":0},14]
[null,"NWC-213/WR","KIT MAGNETE  M.W.","Messina",16,"2014-05-07",null,null,null,{"$f":"IF(SUM(COUNTIF($B$4:$B$64,$J$6:J23))=COUNTA($B$4:$B$64),\"\",OFFSET($B$1,MIN(IF(COUNTIF($J$6:J23,$B$4:$B$64)=0,ROW($B$4:$B$64),COUNTA($B$4:$B$64))-1),0))","v":"FRF-171/ZE"},{"$f":"SUM($E$4:$E$64*($B$4:$B$64=J24)*(IF($K$3=\"Tutti\",1,$D$4:$D$64=$K$3))*($F$4:$F$64>=DATE(2014,1,1))*($F$4:$F$64<DATE(2014,4,1)))","v":0},{"$f":"SUMIFS($E$4:$E$64,$D$4:$D$64,IF($K$3=\"Tutti\",\"*\",$K$3),$B$4:$B$64,J24,$F$4:$F$64,\">=\"&DATE(2014,4,1),$F$4:$F$64,\"<\"&DATE(2014,7,1))","v":0},{"$f":"SUMPRODUCT($E$4:$E$64,IF($B$4:$B$64=J24,1,0),IF($D$4:$D$64=$K$3,1,IF($K$3=\"Tutti\",1,0)),IF($F$4:$F$64>=DATE(2014,7,1),1,0),IF($F$4:$F$64<DATE(2014,10,1),1,0))","v":0},{"$f":"SUM($E$4:$E$64*IF($B$4:$B$64=J24,1,0)*IF($D$4:$D$64=$K$3,1,$K$3=\"Tutti\")*IF($F$4:$F$64>=DATE(2014,10,1),1,0))","v":0},0]
[null,"SYA-341/BM","PIGNONI SEMPLICI 3/4 Z21","Roma",18,"2014-05-12",null,null,null,{"$f":"IF(SUM(COUNTIF($B$4:$B$64,$J$6:J24))=COUNTA($B$4:$B$64),\"\",OFFSET($B$1,MIN(IF(COUNTIF($J$6:J24,$B$4:$B$64)=0,ROW($B$4:$B$64),COUNTA($B$4:$B$64))-1),0))","v":"RVA-370/MO"},{"$f":"SUM($E$4:$E$64*($B$4:$B$64=J25)*(IF($K$3=\"Tutti\",1,$D$4:$D$64=$K$3))*($F$4:$F$64>=DATE(2014,1,1))*($F$4:$F$64<DATE(2014,4,1)))","v":0},{"$f":"SUMIFS($E$4:$E$64,$D$4:$D$64,IF($K$3=\"Tutti\",\"*\",$K$3),$B$4:$B$64,J25,$F$4:$F$64,\">=\"&DATE(2014,4,1),$F$4:$F$64,\"<\"&DATE(2014,7,1))","v":0},{"$f":"SUMPRODUCT($E$4:$E$64,IF($B$4:$B$64=J25,1,0),IF($D$4:$D$64=$K$3,1,IF($K$3=\"Tutti\",1,0)),IF($F$4:$F$64>=DATE(2014,7,1),1,0),IF($F$4:$F$64<DATE(2014,10,1),1,0))","v":0},{"$f":"SUM($E$4:$E$64*IF($B$4:$B$64=J25,1,0)*IF($D$4:$D$64=$K$3,1,$K$3=\"Tutti\")*IF($F$4:$F$64>=DATE(2014,10,1),1,0))","v":0},0]
[null,"OQJ-149/CP","KIT COMPLETO GUARNIZIONI CILINDRO 125","Roma",18,"2014-05-20",null,null,null,{"$f":"IF(SUM(COUNTIF($B$4:$B$64,$J$6:J25))=COUNTA($B$4:$B$64),\"\",OFFSET($B$1,MIN(IF(COUNTIF($J$6:J25,$B$4:$B$64)=0,ROW($B$4:$B$64),COUNTA($B$4:$B$64))-1),0))","v":"EJJ-243/RK"},{"$f":"SUM($E$4:$E$64*($B$4:$B$64=J26)*(IF($K$3=\"Tutti\",1,$D$4:$D$64=$K$3))*($F$4:$F$64>=DATE(2014,1,1))*($F$4:$F$64<DATE(2014,4,1)))","v":0},{"$f":"SUMIFS($E$4:$E$64,$D$4:$D$64,IF($K$3=\"Tutti\",\"*\",$K$3),$B$4:$B$64,J26,$F$4:$F$64,\">=\"&DATE(2014,4,1),$F$4:$F$64,\"<\"&DATE(2014,7,1))","v":0},{"$f":"SUMPRODUCT($E$4:$E$64,IF($B$4:$B$64=J26,1,0),IF($D$4:$D$64=$K$3,1,IF($K$3=\"Tutti\",1,0)),IF($F$4:$F$64>=DATE(2014,7,1),1,0),IF($F$4:$F$64<DATE(2014,10,1),1,0))","v":0},{"$f":"SUM($E$4:$E$64*IF($B$4:$B$64=J26,1,0)*IF($D$4:$D$64=$K$3,1,$K$3=\"Tutti\")*IF($F$4:$F$64>=DATE(2014,10,1),1,0))","v":0},0]
[null,"SYA-341/BM","PIGNONI SEMPLICI 3/4 Z21","Roma",18,"2014-05-27",null,null,null,{"$f":"IF(SUM(COUNTIF($B$4:$B$64,$J$6:J26))=COUNTA($B$4:$B$64),\"\",OFFSET($B$1,MIN(IF(COUNTIF($J$6:J26,$B$4:$B$64)=0,ROW($B$4:$B$64),COUNTA($B$4:$B$64))-1),0))","v":"LBW-277/ME"},{"$f":"SUM($E$4:$E$64*($B$4:$B$64=J27)*(IF($K$3=\"Tutti\",1,$D$4:$D$64=$K$3))*($F$4:$F$64>=DATE(2014,1,1))*($F$4:$F$64<DATE(2014,4,1)))","v":0},{"$f":"SUMIFS($E$4:$E$64,$D$4:$D$64,IF($K$3=\"Tutti\",\"*\",$K$3),$B$4:$B$64,J27,$F$4:$F$64,\">=\"&DATE(2014,4,1),$F$4:$F$64,\"<\"&DATE(2014,7,1))","v":0},{"$f":"SUMPRODUCT($E$4:$E$64,IF($B$4:$B$64=J27,1,0),IF($D$4:$D$64=$K$3,1,IF($K$3=\"Tutti\",1,0)),IF($F$4:$F$64>=DATE(2014,7,1),1,0),IF($F$4:$F$64<DATE(2014,10,1),1,0))","v":16},{"$f":"SUM($E$4:$E$64*IF($B$4:$B$64=J27,1,0)*IF($D$4:$D$64=$K$3,1,$K$3=\"Tutti\")*IF($F$4:$F$64>=DATE(2014,10,1),1,0))","v":0},16]
[null,"OCI-162/XK","KIT COMPLETO GUARNIZIONI CILINDRO 80 CMPC","Brescia",18,"2014-05-30",null,null,null,{"$f":"IF(SUM(COUNTIF($B$4:$B$64,$J$6:J27))=COUNTA($B$4:$B$64),\"\",OFFSET($B$1,MIN(IF(COUNTIF($J$6:J27,$B$4:$B$64)=0,ROW($B$4:$B$64),COUNTA($B$4:$B$64))-1),0))","v":"HOU-335/QO"},{"$f":"SUM($E$4:$E$64*($B$4:$B$64=J28)*(IF($K$3=\"Tutti\",1,$D$4:$D$64=$K$3))*($F$4:$F$64>=DATE(2014,1,1))*($F$4:$F$64<DATE(2014,4,1)))","v":0},{"$f":"SUMIFS($E$4:$E$64,$D$4:$D$64,IF($K$3=\"Tutti\",\"*\",$K$3),$B$4:$B$64,J28,$F$4:$F$64,\">=\"&DATE(2014,4,1),$F$4:$F$64,\"<\"&DATE(2014,7,1))","v":0},{"$f":"SUMPRODUCT($E$4:$E$64,IF($B$4:$B$64=J28,1,0),IF($D$4:$D$64=$K$3,1,IF($K$3=\"Tutti\",1,0)),IF($F$4:$F$64>=DATE(2014,7,1),1,0),IF($F$4:$F$64<DATE(2014,10,1),1,0))","v":0},{"$f":"SUM($E$4:$E$64*IF($B$4:$B$64=J28,1,0)*IF($D$4:$D$64=$K$3,1,$K$3=\"Tutti\")*IF($F$4:$F$64>=DATE(2014,10,1),1,0))","v":0},{"$f":"SUM(K28:N28)","v":0}]
[null,"HYM-126/TJ","VALVOLA RIDUTTRICE DI PRESSIONE  DA 40 MBAR","Milano",14,"2014-06-05"]
[null,"LCJ-304/BX","KIT REVISIONE CILINDRO M.W.","Milano",10,"2014-06-11"]
[null,"RVG-263/JX","SERVOVALVOLA CON ROTORE DINAMICO","Messina",8,"2014-06-17"]
[null,"OQJ-149/CP","KIT COMPLETO GUARNIZIONI CILINDRO 125","Messina",16,"2014-06-25"]
[null,"DBY-128/GN","AMMONIACA ANIDRA UN BOMBOLA DA KG.25","Roma",8,"2014-06-28"]
[null,"SGY-295/PG","PIGNONE SEMPL. 3/4 Z9\"","Brescia",10,"2014-06-30"]
[null,"NWC-213/WR","KIT MAGNETE  M.W.","Messina",10,"2014-07-07"]
[null,"FRF-171/ZE","KIT GUARNIZIONI LC25...6X/LC25DB/DR-5X","Firenze",12,"2014-07-10"]
[null,"OCI-162/XK","KIT COMPLETO GUARNIZIONI CILINDRO 80 CMPC","Firenze",12,"2014-07-18"]
[null,"GTN-188/OI","VALVOLA RITEGNO A PIASTRA Z1S 10 P2-3X/V","Milano",16,"2014-07-24"]
[null,"RVA-370/MO","ELEMENTO LOGICO LC 40 DB20E7X/","Messina",6,"2014-07-29"]
[null,"EJJ-243/RK","OLFLEX FD CLASSIC 810 7G0,5","Roma",16,"2014-08-06"]
[null,"HYM-126/TJ","VALVOLA RIDUTTRICE DI PRESSIONE  DA 40 MBAR","Brescia",14,"2014-08-13"]
[null,"LBW-277/ME","KIT COMPLETO GUARNIZIONI PER CILINDRO 80","Milano",16,"2014-08-19"]
[null,"RVG-263/JX","SERVOVALVOLA CON ROTORE DINAMICO","Milano",16,"2014-08-22"]
[null,"OQJ-149/CP","KIT COMPLETO GUARNIZIONI CILINDRO 125","Roma",6,"2014-08-25"]
[null,"RVA-370/MO","ELEMENTO LOGICO LC 40 DB20E7X/","Brescia",14,"2014-08-30"]
[null,"DBY-128/GN","AMMONIACA ANIDRA UN BOMBOLA DA KG.25","Firenze",12,"2014-09-02"]
[null,"LCJ-304/BX","KIT REVISIONE CILINDRO M.W.","Milano",4,"2014-09-08"]
[null,"LCJ-304/BX","KIT REVISIONE CILINDRO M.W.","Messina",16,"2014-09-10"]
[null,"GTN-188/OI","VALVOLA RITEGNO A PIASTRA Z1S 10 P2-3X/V","Messina",18,"2014-09-14"]
[null,"OYZ-311/GH","COPERCHIO ELEMENTO LOGICO LFA 25 KWA-7X/","Roma",14,"2014-09-17"]
[null,"QBI-332/YQ","FORCELLA FEMMINA CON SNODO SGS/M16X1.5","Messina",16,"2014-09-22"]
[null,"OQJ-149/CP","KIT COMPLETO GUARNIZIONI CILINDRO 125","Messina",8,"2014-09-28"]
[null,"HOU-335/QO","VALVOLA DI RITEGNO PILOTATA   Z2FS 16-3X/S2","Roma",12,"2014-09-30"]
[null,"RVG-263/JX","SERVOVALVOLA CON ROTORE DINAMICO","Brescia",12,"2014-10-08"]
[null,"FRF-171/ZE","KIT GUARNIZIONI LC25...6X/LC25DB/DR-5X","Firenze",18,"2014-10-16"]
[null,"FRF-171/ZE","KIT GUARNIZIONI LC25...6X/LC25DB/DR-5X","Brescia",16,"2014-10-22"]
[null,"KWO-343/SK","VITI TCCEI 12.9 UNI 5931 BR. M20 X 140","Firenze",12,"2014-10-28"]
[null,"IGF-330/RW","RUOTE 65 SERIE RINFORZATA CON FRENO","Milano",14,"2014-11-01"]
[null,"EVW-340/RN","OLFLEX FD CLASSIC 810 CY 4G0,5","Brescia",8,"2014-11-09"]
[null,"OQJ-149/CP","KIT COMPLETO GUARNIZIONI CILINDRO 125","Firenze",4,"2014-11-13"]
[null,"LBW-277/ME","KIT COMPLETO GUARNIZIONI PER CILINDRO 80","Messina",8,"2014-11-20"]
[null,"KWO-343/SK","VITI TCCEI 12.9 UNI 5931 BR. M20 X 140","Milano",18,"2014-11-26"]
[null,"RVA-370/MO","ELEMENTO LOGICO LC 40 DB20E7X/","Messina",14,"2014-12-04"]
[null,"BVD-350/EJ","CARTUCCIA FILTRO DA 8 MICRON","Brescia",4,"2014-12-12"]

{"sheet":"Marius44","index":1,"n_rows":64,"n_cols":15,"rows_kept":64,"cut":false,"hidden":false,"merged":[]}
[null,"TABELLA ARTICOLI PRELEVATI NEL 2014 DAI DIVERSI MAGAZZINI",null,null,null,null,null,null,null,"TABELLA ARTICOLI PRELEVATI NEL 2014 E SUDDIVISI PER TRIMESTRE"]
[]
[null,"COD. ART.","DESCRIZIONE ARTICOLO","SEDE","Q.TA' prelevata","DATA",null,null,null,"SELEZIONARE IL MAGAZZINO : ","Milano"]
[null,"KWO-343/SK","VITI TCCEI 12.9 UNI 5931 BR. M20 X 140","Brescia",18,"2014-01-15"]
[null,"SGY-295/PG","PIGNONE SEMPL. 3/4 Z9\"","Milano",10,"2014-01-18",null,null,null,"COD. ART.","I° TRIM.","II° TRIM.","III° TRIM.","IV° TRIM","TOTALE"]
[null,"QBI-332/YQ","FORCELLA FEMMINA CON SNODO SGS/M16X1.5","Roma",6,"2014-01-25",null,null,null,"SGY-295/PG",10,null,null,null,{"$f":"SUM(K6:N6)","v":10}]
[null,"RVG-263/JX","SERVOVALVOLA CON ROTORE DINAMICO","Firenze",4,"2014-02-01",null,null,null,"BVD-350/EJ",null,4,null,null,{"$f":"SUM(K7:N7)","v":4}]
[null,"SGY-295/PG","PIGNONE SEMPL. 3/4 Z9\"","Roma",6,"2014-02-09",null,null,null,"NWC-213/WR",null,6,null,null,{"$f":"SUM(K8:N8)","v":6}]
[null,"OQJ-149/CP","KIT COMPLETO GUARNIZIONI CILINDRO 125","Firenze",10,"2014-02-11",null,null,null,"WTT-322/YR",null,14,null,null,{"$f":"SUM(K9:N9)","v":14}]
[null,"GTN-188/OI","VALVOLA RITEGNO A PIASTRA Z1S 10 P2-3X/V","Roma",4,"2014-02-16",null,null,null,"HYM-126/TJ",null,14,null,null,{"$f":"SUM(K10:N10)","v":14}]
[null,"KWO-343/SK","VITI TCCEI 12.9 UNI 5931 BR. M20 X 140","Brescia",12,"2014-02-23",null,null,null,"LCJ-304/BX",null,10,null,null,{"$f":"SUM(K11:N11)","v":10}]
[null,"IAB-347/TY","REGOLATORE DI FLUSSO Z2FS 10-3-3 X/ V","Roma",4,"2014-03-01",null,null,null,"GTN-188/OI",null,null,16,null,{"$f":"SUM(K12:N12)","v":16}]
[null,"SGY-295/PG","PIGNONE SEMPL. 3/4 Z9\"","Firenze",6,"2014-03-05",null,null,null,"LBW-277/ME",null,null,16,null,{"$f":"SUM(K13:N13)","v":16}]
[null,"OYZ-311/GH","COPERCHIO ELEMENTO LOGICO LFA 25 KWA-7X/","Firenze",4,"2014-03-10",null,null,null,"RVG-263/JX",null,null,16,null,{"$f":"SUM(K14:N14)","v":16}]
[null,"DBY-128/GN","AMMONIACA ANIDRA UN BOMBOLA DA KG.25","Brescia",14,"2014-03-18",null,null,null,"LCJ-304/BX",null,null,4,null,{"$f":"SUM(K15:N15)","v":4}]
[null,"KWO-343/SK","VITI TCCEI 12.9 UNI 5931 BR. M20 X 140","Firenze",16,"2014-03-23",null,null,null,"IGF-330/RW",null,null,null,14,{"$f":"SUM(K16:N16)","v":14}]
[null,"LCJ-304/BX","KIT REVISIONE CILINDRO M.W.","Brescia",16,"2014-03-26",null,null,null,"KWO-343/SK",null,null,null,18,{"$f":"SUM(K17:N17)","v":18}]
[null,"SYA-341/BM","PIGNONI SEMPLICI 3/4 Z21","Roma",14,"2014-03-31",null,null,null,null,null,null,null,null,{"$f":"SUM(K18:N18)","v":0}]
[null,"IGF-330/RW","RUOTE 65 SERIE RINFORZATA CON FRENO","Brescia",10,"2014-04-06",null,null,null,null,null,null,null,null,{"$f":"SUM(K19:N19)","v":0}]
[null,"BVD-350/EJ","CARTUCCIA FILTRO DA 8 MICRON","Milano",4,"2014-04-09",null,null,null,null,null,null,null,null,{"$f":"SUM(K20:N20)","v":0}]
[null,"EVW-340/RN","OLFLEX FD CLASSIC 810 CY 4G0,5","Firenze",8,"2014-04-16",null,null,null,null,null,null,null,null,{"$f":"SUM(K21:N21)","v":0}]
[null,"NWC-213/WR","KIT MAGNETE  M.W.","Milano",6,"2014-04-23",null,null,null,null,null,null,null,null,{"$f":"SUM(K22:N22)","v":0}]
[null,"WTT-322/YR","CURVA 45ｰ F.F. 1 ZINC.\"","Milano",14,"2014-04-30",null,null,null,null,null,null,null,null,{"$f":"SUM(K23:N23)","v":0}]
[null,"NWC-213/WR","KIT MAGNETE  M.W.","Messina",16,"2014-05-07",null,null,null,null,null,null,null,null,{"$f":"SUM(K24:N24)","v":0}]
[null,"SYA-341/BM","PIGNONI SEMPLICI 3/4 Z21","Roma",18,"2014-05-12",null,null,null,null,null,null,null,null,{"$f":"SUM(K25:N25)","v":0}]
[null,"OQJ-149/CP","KIT COMPLETO GUARNIZIONI CILINDRO 125","Roma",18,"2014-05-20",null,null,null,null,null,null,null,null,{"$f":"SUM(K26:N26)","v":0}]
[null,"SYA-341/BM","PIGNONI SEMPLICI 3/4 Z21","Roma",18,"2014-05-27",null,null,null,null,null,null,null,null,{"$f":"SUM(K27:N27)","v":0}]
[null,"OCI-162/XK","KIT COMPLETO GUARNIZIONI CILINDRO 80 CMPC","Brescia",18,"2014-05-30",null,null,null,null,null,null,null,null,{"$f":"SUM(K28:N28)","v":0}]
[null,"HYM-126/TJ","VALVOLA RIDUTTRICE DI PRESSIONE  DA 40 MBAR","Milano",14,"2014-06-05"]
[null,"LCJ-304/BX","KIT REVISIONE CILINDRO M.W.","Milano",10,"2014-06-11"]
[null,"RVG-263/JX","SERVOVALVOLA CON ROTORE DINAMICO","Messina",8,"2014-06-17"]
[null,"OQJ-149/CP","KIT COMPLETO GUARNIZIONI CILINDRO 125","Messina",16,"2014-06-25"]
[null,"DBY-128/GN","AMMONIACA ANIDRA UN BOMBOLA DA KG.25","Roma",8,"2014-06-28"]
[null,"SGY-295/PG","PIGNONE SEMPL. 3/4 Z9\"","Brescia",10,"2014-06-30"]
[null,"NWC-213/WR","KIT MAGNETE  M.W.","Messina",10,"2014-07-07"]
[null,"FRF-171/ZE","KIT GUARNIZIONI LC25...6X/LC25DB/DR-5X","Firenze",12,"2014-07-10"]
[null,"OCI-162/XK","KIT COMPLETO GUARNIZIONI CILINDRO 80 CMPC","Firenze",12,"2014-07-18"]
[null,"GTN-188/OI","VALVOLA RITEGNO A PIASTRA Z1S 10 P2-3X/V","Milano",16,"2014-07-24"]
[null,"RVA-370/MO","ELEMENTO LOGICO LC 40 DB20E7X/","Messina",6,"2014-07-29"]
[null,"EJJ-243/RK","OLFLEX FD CLASSIC 810 7G0,5","Roma",16,"2014-08-06"]
[null,"HYM-126/TJ","VALVOLA RIDUTTRICE DI PRESSIONE  DA 40 MBAR","Brescia",14,"2014-08-13"]
[null,"LBW-277/ME","KIT COMPLETO GUARNIZIONI PER CILINDRO 80","Milano",16,"2014-08-19"]
[null,"RVG-263/JX","SERVOVALVOLA CON ROTORE DINAMICO","Milano",16,"2014-08-22"]
[null,"OQJ-149/CP","KIT COMPLETO GUARNIZIONI CILINDRO 125","Roma",6,"2014-08-25"]
[null,"RVA-370/MO","ELEMENTO LOGICO LC 40 DB20E7X/","Brescia",14,"2014-08-30"]
[null,"DBY-128/GN","AMMONIACA ANIDRA UN BOMBOLA DA KG.25","Firenze",12,"2014-09-02"]
[null,"LCJ-304/BX","KIT REVISIONE CILINDRO M.W.","Milano",4,"2014-09-08"]
[null,"LCJ-304/BX","KIT REVISIONE CILINDRO M.W.","Messina",16,"2014-09-10"]
[null,"GTN-188/OI","VALVOLA RITEGNO A PIASTRA Z1S 10 P2-3X/V","Messina",18,"2014-09-14"]
[null,"OYZ-311/GH","COPERCHIO ELEMENTO LOGICO LFA 25 KWA-7X/","Roma",14,"2014-09-17"]
[null,"QBI-332/YQ","FORCELLA FEMMINA CON SNODO SGS/M16X1.5","Messina",16,"2014-09-22"]
[null,"OQJ-149/CP","KIT COMPLETO GUARNIZIONI CILINDRO 125","Messina",8,"2014-09-28"]
[null,"HOU-335/QO","VALVOLA DI RITEGNO PILOTATA   Z2FS 16-3X/S2","Roma",12,"2014-09-30"]
[null,"RVG-263/JX","SERVOVALVOLA CON ROTORE DINAMICO","Brescia",12,"2014-10-08"]
[null,"FRF-171/ZE","KIT GUARNIZIONI LC25...6X/LC25DB/DR-5X","Firenze",18,"2014-10-16"]
[null,"FRF-171/ZE","KIT GUARNIZIONI LC25...6X/LC25DB/DR-5X","Brescia",16,"2014-10-22"]
[null,"KWO-343/SK","VITI TCCEI 12.9 UNI 5931 BR. M20 X 140","Firenze",12,"2014-10-28"]
[null,"IGF-330/RW","RUOTE 65 SERIE RINFORZATA CON FRENO","Milano",14,"2014-11-01"]
[null,"EVW-340/RN","OLFLEX FD CLASSIC 810 CY 4G0,5","Brescia",8,"2014-11-09"]
[null,"OQJ-149/CP","KIT COMPLETO GUARNIZIONI CILINDRO 125","Firenze",4,"2014-11-13"]
[null,"LBW-277/ME","KIT COMPLETO GUARNIZIONI PER CILINDRO 80","Messina",8,"2014-11-20"]
[null,"KWO-343/SK","VITI TCCEI 12.9 UNI 5931 BR. M20 X 140","Milano",18,"2014-11-26"]
[null,"RVA-370/MO","ELEMENTO LOGICO LC 40 DB20E7X/","Messina",14,"2014-12-04"]
[null,"BVD-350/EJ","CARTUCCIA FILTRO DA 8 MICRON","Brescia",4,"2014-12-12"]

{"sheet":"ninai","index":2,"n_rows":64,"n_cols":15,"rows_kept":64,"cut":false,"hidden":false,"merged":[]}
[null,"TABELLA ARTICOLI PRELEVATI NEL 2014 DAI DIVERSI MAGAZZINI",null,null,null,null,null,null,null,"TABELLA ARTICOLI PRELEVATI NEL 2014 E SUDDIVISI PER TRIMESTRE"]
[null,null,null,null,{"$f":"SUM(E4:E64)","v":706}]
[null,"COD. ART.","DESCRIZIONE ARTICOLO","SEDE","Q.TA' prelevata","DATA",null,null,null,"SELEZIONARE IL MAGAZZINO : ","Roma"]
[null,"KWO-343/SK","VITI TCCEI 12.9 UNI 5931 BR. M20 X 140","Brescia",18,"2014-01-15",null,null,null,null,null,null,null,null,{"$f":"SUM(O6:O30)","v":144}]
[null,"SGY-295/PG","PIGNONE SEMPL. 3/4 Z9\"","Milano",10,"2014-01-18",null,null,null,"Elenco Univoco Articoli","I° TRIM.","II° TRIM.","III° TRIM.","IV° TRIM","TOTALE"]
[null,"QBI-332/YQ","FORCELLA FEMMINA CON SNODO SGS/M16X1.5","Roma",6,"2014-01-25",null,null,null,{"$f":"IFERROR(IF($K$3=\"tutti\",INDEX($B$4:$B$64,MATCH(0,INDEX(COUNTIF($J$5:J5,$B$4:$B$64),),0)),INDEX($B$4:$B$64,MATCH(0,INDEX(COUNTIF($J$5:J5,$B$4:$B$64)+($D$4:$D$64<>$K$3),),0))),\"\")","v":"QBI-332/YQ"},{"$f":"IF($K$3=\"tutti\",SUMPRODUCT(($B$4:$B$64=$J6)*(INT((MONTH($F$4:$F$64)-1)/3)+1=COLUMN(A$1))*$E$4:$E$64),SUMPRODUCT(($B$4:$B$64=$J6)*($D$4:$D$64=$K$3)*(INT((MONTH($F$4:$F$64)-1)/3)+1=COLUMN(A$1))*$E$4:$E$64))","v":6},{"$f":"IF($K$3=\"tutti\",SUMPRODUCT(($B$4:$B$64=$J6)*(INT((MONTH($F$4:$F$64)-1)/3)+1=COLUMN(B$1))*$E$4:$E$64),SUMPRODUCT(($B$4:$B$64=$J6)*($D$4:$D$64=$K$3)*(INT((MONTH($F$4:$F$64)-1)/3)+1=COLUMN(B$1))*$E$4:$E$64))","v":0},0,0,{"$f":"SUM(K6:N6)","v":6}]
[null,"RVG-263/JX","SERVOVALVOLA CON ROTORE DINAMICO","Firenze",4,"2014-02-01",null,null,null,{"$f":"IFERROR(IF($K$3=\"tutti\",INDEX($B$4:$B$64,MATCH(0,INDEX(COUNTIF($J$5:J6,$B$4:$B$64),),0)),INDEX($B$4:$B$64,MATCH(0,INDEX(COUNTIF($J$5:J6,$B$4:$B$64)+($D$4:$D$64<>$K$3),),0))),\"\")","v":"SGY-295/PG"},{"$f":"IF($K$3=\"tutti\",SUMPRODUCT(($B$4:$B$64=$J7)*(INT((MONTH($F$4:$F$64)-1)/3)+1=COLUMN(A$1))*$E$4:$E$64),SUMPRODUCT(($B$4:$B$64=$J7)*($D$4:$D$64=$K$3)*(INT((MONTH($F$4:$F$64)-1)/3)+1=COLUMN(A$1))*$E$4:$E$64))","v":6},0,0,0,{"$f":"SUM(K7:N7)","v":6}]
[null,"SGY-295/PG","PIGNONE SEMPL. 3/4 Z9\"","Roma",6,"2014-02-09",null,null,null,{"$f":"IFERROR(IF($K$3=\"tutti\",INDEX($B$4:$B$64,MATCH(0,INDEX(COUNTIF($J$5:J7,$B$4:$B$64),),0)),INDEX($B$4:$B$64,MATCH(0,INDEX(COUNTIF($J$5:J7,$B$4:$B$64)+($D$4:$D$64<>$K$3),),0))),\"\")","v":"GTN-188/OI"},4,0,0,0,4]
[null,"OQJ-149/CP","KIT COMPLETO GUARNIZIONI CILINDRO 125","Firenze",10,"2014-02-11",null,null,null,{"$f":"IFERROR(IF($K$3=\"tutti\",INDEX($B$4:$B$64,MATCH(0,INDEX(COUNTIF($J$5:J8,$B$4:$B$64),),0)),INDEX($B$4:$B$64,MATCH(0,INDEX(COUNTIF($J$5:J8,$B$4:$B$64)+($D$4:$D$64<>$K$3),),0))),\"\")","v":"IAB-347/TY"},4,0,0,0,4]
[null,"GTN-188/OI","VALVOLA RITEGNO A PIASTRA Z1S 10 P2-3X/V","Roma",4,"2014-02-16",null,null,null,{"$f":"IFERROR(IF($K$3=\"tutti\",INDEX($B$4:$B$64,MATCH(0,INDEX(COUNTIF($J$5:J9,$B$4:$B$64),),0)),INDEX($B$4:$B$64,MATCH(0,INDEX(COUNTIF($J$5:J9,$B$4:$B$64)+($D$4:$D$64<>$K$3),),0))),\"\")","v":"SYA-341/BM"},14,36,0,0,50]
[null,"KWO-343/SK","VITI TCCEI 12.9 UNI 5931 BR. M20 X 140","Brescia",12,"2014-02-23",null,null,null,{"$f":"IFERROR(IF($K$3=\"tutti\",INDEX($B$4:$B$64,MATCH(0,INDEX(COUNTIF($J$5:J10,$B$4:$B$64),),0)),INDEX($B$4:$B$64,MATCH(0,INDEX(COUNTIF($J$5:J10,$B$4:$B$64)+($D$4:$D$64<>$K$3),),0))),\"\")","v":"OQJ-149/CP"},0,18,6,0,24]
[null,"IAB-347/TY","REGOLATORE DI FLUSSO Z2FS 10-3-3 X/ V","Roma",4,"2014-03-01",null,null,null,{"$f":"IFERROR(IF($K$3=\"tutti\",INDEX($B$4:$B$64,MATCH(0,INDEX(COUNTIF($J$5:J11,$B$4:$B$64),),0)),INDEX($B$4:$B$64,MATCH(0,INDEX(COUNTIF($J$5:J11,$B$4:$B$64)+($D$4:$D$64<>$K$3),),0))),\"\")","v":"DBY-128/GN"},0,8,0,0,8]
[null,"SGY-295/PG","PIGNONE SEMPL. 3/4 Z9\"","Firenze",6,"2014-03-05",null,null,null,{"$f":"IFERROR(IF($K$3=\"tutti\",INDEX($B$4:$B$64,MATCH(0,INDEX(COUNTIF($J$5:J12,$B$4:$B$64),),0)),INDEX($B$4:$B$64,MATCH(0,INDEX(COUNTIF($J$5:J12,$B$4:$B$64)+($D$4:$D$64<>$K$3),),0))),\"\")","v":"EJJ-243/RK"},0,0,16,0,16]
[null,"OYZ-311/GH","COPERCHIO ELEMENTO LOGICO LFA 25 KWA-7X/","Firenze",4,"2014-03-10",null,null,null,{"$f":"IFERROR(IF($K$3=\"tutti\",INDEX($B$4:$B$64,MATCH(0,INDEX(COUNTIF($J$5:J13,$B$4:$B$64),),0)),INDEX($B$4:$B$64,MATCH(0,INDEX(COUNTIF($J$5:J13,$B$4:$B$64)+($D$4:$D$64<>$K$3),),0))),\"\")","v":"OYZ-311/GH"},0,0,14,0,14]
[null,"DBY-128/GN","AMMONIACA ANIDRA UN BOMBOLA DA KG.25","Brescia",14,"2014-03-18",null,null,null,{"$f":"IFERROR(IF($K$3=\"tutti\",INDEX($B$4:$B$64,MATCH(0,INDEX(COUNTIF($J$5:J14,$B$4:$B$64),),0)),INDEX($B$4:$B$64,MATCH(0,INDEX(COUNTIF($J$5:J14,$B$4:$B$64)+($D$4:$D$64<>$K$3),),0))),\"\")","v":"HOU-335/QO"},0,0,12,0,12]
[null,"KWO-343/SK","VITI TCCEI 12.9 UNI 5931 BR. M20 X 140","Firenze",16,"2014-03-23",null,null,null,{"$f":"IFERROR(IF($K$3=\"tutti\",INDEX($B$4:$B$64,MATCH(0,INDEX(COUNTIF($J$5:J15,$B$4:$B$64),),0)),INDEX($B$4:$B$64,MATCH(0,INDEX(COUNTIF($J$5:J15,$B$4:$B$64)+($D$4:$D$64<>$K$3),),0))),\"\")","v":""},0,0,0,0,0]
[null,"LCJ-304/BX","KIT REVISIONE CILINDRO M.W.","Brescia",16,"2014-03-26",null,null,null,{"$f":"IFERROR(IF($K$3=\"tutti\",INDEX($B$4:$B$64,MATCH(0,INDEX(COUNTIF($J$5:J16,$B$4:$B$64),),0)),INDEX($B$4:$B$64,MATCH(0,INDEX(COUNTIF($J$5:J16,$B$4:$B$64)+($D$4:$D$64<>$K$3),),0))),\"\")","v":""},0,0,0,0,0]
[null,"SYA-341/BM","PIGNONI SEMPLICI 3/4 Z21","Roma",14,"2014-03-31",null,null,null,{"$f":"IFERROR(IF($K$3=\"tutti\",INDEX($B$4:$B$64,MATCH(0,INDEX(COUNTIF($J$5:J17,$B$4:$B$64),),0)),INDEX($B$4:$B$64,MATCH(0,INDEX(COUNTIF($J$5:J17,$B$4:$B$64)+($D$4:$D$64<>$K$3),),0))),\"\")","v":""},0,0,0,0,0]
[null,"IGF-330/RW","RUOTE 65 SERIE RINFORZATA CON FRENO","Brescia",10,"2014-04-06",null,null,null,{"$f":"IFERROR(IF($K$3=\"tutti\",INDEX($B$4:$B$64,MATCH(0,INDEX(COUNTIF($J$5:J18,$B$4:$B$64),),0)),INDEX($B$4:$B$64,MATCH(0,INDEX(COUNTIF($J$5:J18,$B$4:$B$64)+($D$4:$D$64<>$K$3),),0))),\"\")","v":""},0,0,0,0,0]
[null,"BVD-350/EJ","CARTUCCIA FILTRO DA 8 MICRON","Milano",4,"2014-04-09",null,null,null,{"$f":"IFERROR(IF($K$3=\"tutti\",INDEX($B$4:$B$64,MATCH(0,INDEX(COUNTIF($J$5:J19,$B$4:$B$64),),0)),INDEX($B$4:$B$64,MATCH(0,INDEX(COUNTIF($J$5:J19,$B$4:$B$64)+($D$4:$D$64<>$K$3),),0))),\"\")","v":""},0,0,0,0,0]
[null,"EVW-340/RN","OLFLEX FD CLASSIC 810 CY 4G0,5","Firenze",8,"2014-04-16",null,null,null,{"$f":"IFERROR(IF($K$3=\"tutti\",INDEX($B$4:$B$64,MATCH(0,INDEX(COUNTIF($J$5:J20,$B$4:$B$64),),0)),INDEX($B$4:$B$64,MATCH(0,INDEX(COUNTIF($J$5:J20,$B$4:$B$64)+($D$4:$D$64<>$K$3),),0))),\"\")","v":""},0,0,0,0,0]
[null,"NWC-213/WR","KIT MAGNETE  M.W.","Milano",6,"2014-04-23",null,null,null,{"$f":"IFERROR(IF($K$3=\"tutti\",INDEX($B$4:$B$64,MATCH(0,INDEX(COUNTIF($J$5:J21,$B$4:$B$64),),0)),INDEX($B$4:$B$64,MATCH(0,INDEX(COUNTIF($J$5:J21,$B$4:$B$64)+($D$4:$D$64<>$K$3),),0))),\"\")","v":""},0,0,0,0,0]
[null,"WTT-322/YR","CURVA 45ｰ F.F. 1 ZINC.\"","Milano",14,"2014-04-30",null,null,null,{"$f":"IFERROR(IF($K$3=\"tutti\",INDEX($B$4:$B$64,MATCH(0,INDEX(COUNTIF($J$5:J22,$B$4:$B$64),),0)),INDEX($B$4:$B$64,MATCH(0,INDEX(COUNTIF($J$5:J22,$B$4:$B$64)+($D$4:$D$64<>$K$3),),0))),\"\")","v":""},0,0,0,0,0]
[null,"NWC-213/WR","KIT MAGNETE  M.W.","Messina",16,"2014-05-07",null,null,null,{"$f":"IFERROR(IF($K$3=\"tutti\",INDEX($B$4:$B$64,MATCH(0,INDEX(COUNTIF($J$5:J23,$B$4:$B$64),),0)),INDEX($B$4:$B$64,MATCH(0,INDEX(COUNTIF($J$5:J23,$B$4:$B$64)+($D$4:$D$64<>$K$3),),0))),\"\")","v":""},0,0,0,0,0]
[null,"SYA-341/BM","PIGNONI SEMPLICI 3/4 Z21","Roma",18,"2014-05-12",null,null,null,{"$f":"IFERROR(IF($K$3=\"tutti\",INDEX($B$4:$B$64,MATCH(0,INDEX(COUNTIF($J$5:J24,$B$4:$B$64),),0)),INDEX($B$4:$B$64,MATCH(0,INDEX(COUNTIF($J$5:J24,$B$4:$B$64)+($D$4:$D$64<>$K$3),),0))),\"\")","v":""},0,0,0,0,0]
[null,"OQJ-149/CP","KIT COMPLETO GUARNIZIONI CILINDRO 125","Roma",18,"2014-05-20",null,null,null,{"$f":"IFERROR(IF($K$3=\"tutti\",INDEX($B$4:$B$64,MATCH(0,INDEX(COUNTIF($J$5:J25,$B$4:$B$64),),0)),INDEX($B$4:$B$64,MATCH(0,INDEX(COUNTIF($J$5:J25,$B$4:$B$64)+($D$4:$D$64<>$K$3),),0))),\"\")","v":""},0,0,0,0,0]
[null,"SYA-341/BM","PIGNONI SEMPLICI 3/4 Z21","Roma",18,"2014-05-27",null,null,null,{"$f":"IFERROR(IF($K$3=\"tutti\",INDEX($B$4:$B$64,MATCH(0,INDEX(COUNTIF($J$5:J26,$B$4:$B$64),),0)),INDEX($B$4:$B$64,MATCH(0,INDEX(COUNTIF($J$5:J26,$B$4:$B$64)+($D$4:$D$64<>$K$3),),0))),\"\")","v":""},0,0,0,0,0]
[null,"OCI-162/XK","KIT COMPLETO GUARNIZIONI CILINDRO 80 CMPC","Brescia",18,"2014-05-30",null,null,null,{"$f":"IFERROR(IF($K$3=\"tutti\",INDEX($B$4:$B$64,MATCH(0,INDEX(COUNTIF($J$5:J27,$B$4:$B$64),),0)),INDEX($B$4:$B$64,MATCH(0,INDEX(COUNTIF($J$5:J27,$B$4:$B$64)+($D$4:$D$64<>$K$3),),0))),\"\")","v":""},0,0,0,0,{"$f":"SUM(K28:N28)","v":0}]
[null,"HYM-126/TJ","VALVOLA RIDUTTRICE DI PRESSIONE  DA 40 MBAR","Milano",14,"2014-06-05",null,null,null,{"$f":"IFERROR(IF($K$3=\"tutti\",INDEX($B$4:$B$64,MATCH(0,INDEX(COUNTIF($J$5:J28,$B$4:$B$64),),0)),INDEX($B$4:$B$64,MATCH(0,INDEX(COUNTIF($J$5:J28,$B$4:$B$64)+($D$4:$D$64<>$K$3),),0))),\"\")","v":""},0,0,0,0,{"$f":"SUM(K29:N29)","v":0}]
[null,"LCJ-304/BX","KIT REVISIONE CILINDRO M.W.","Milano",10,"2014-06-11",null,null,null,{"$f":"IFERROR(IF($K$3=\"tutti\",INDEX($B$4:$B$64,MATCH(0,INDEX(COUNTIF($J$5:J29,$B$4:$B$64),),0)),INDEX($B$4:$B$64,MATCH(0,INDEX(COUNTIF($J$5:J29,$B$4:$B$64)+($D$4:$D$64<>$K$3),),0))),\"\")","v":""},0,0,0,0,0]
[null,"RVG-263/JX","SERVOVALVOLA CON ROTORE DINAMICO","Messina",8,"2014-06-17"]
[null,"OQJ-149/CP","KIT COMPLETO GUARNIZIONI CILINDRO 125","Messina",16,"2014-06-25"]
[null,"DBY-128/GN","AMMONIACA ANIDRA UN BOMBOLA DA KG.25","Roma",8,"2014-06-28"]
[null,"SGY-295/PG","PIGNONE SEMPL. 3/4 Z9\"","Brescia",10,"2014-06-30"]
[null,"NWC-213/WR","KIT MAGNETE  M.W.","Messina",10,"2014-07-07"]
[null,"FRF-171/ZE","KIT GUARNIZIONI LC25...6X/LC25DB/DR-5X","Firenze",12,"2014-07-10"]
[null,"OCI-162/XK","KIT COMPLETO GUARNIZIONI CILINDRO 80 CMPC","Firenze",12,"2014-07-18"]
[null,"GTN-188/OI","VALVOLA RITEGNO A PIASTRA Z1S 10 P2-3X/V","Milano",16,"2014-07-24"]
[null,"RVA-370/MO","ELEMENTO LOGICO LC 40 DB20E7X/","Messina",6,"2014-07-29"]
[null,"EJJ-243/RK","OLFLEX FD CLASSIC 810 7G0,5","Roma",16,"2014-08-06"]
[null,"HYM-126/TJ","VALVOLA RIDUTTRICE DI PRESSIONE  DA 40 MBAR","Brescia",14,"2014-08-13"]
[null,"LBW-277/ME","KIT COMPLETO GUARNIZIONI PER CILINDRO 80","Milano",16,"2014-08-19"]
[null,"RVG-263/JX","SERVOVALVOLA CON ROTORE DINAMICO","Milano",16,"2014-08-22"]
[null,"OQJ-149/CP","KIT COMPLETO GUARNIZIONI CILINDRO 125","Roma",6,"2014-08-25"]
[null,"RVA-370/MO","ELEMENTO LOGICO LC 40 DB20E7X/","Brescia",14,"2014-08-30"]
[null,"DBY-128/GN","AMMONIACA ANIDRA UN BOMBOLA DA KG.25","Firenze",12,"2014-09-02"]
[null,"LCJ-304/BX","KIT REVISIONE CILINDRO M.W.","Milano",4,"2014-09-08"]
[null,"LCJ-304/BX","KIT REVISIONE CILINDRO M.W.","Messina",16,"2014-09-10"]
[null,"GTN-188/OI","VALVOLA RITEGNO A PIASTRA Z1S 10 P2-3X/V","Messina",18,"2014-09-14"]
[null,"OYZ-311/GH","COPERCHIO ELEMENTO LOGICO LFA 25 KWA-7X/","Roma",14,"2014-09-17"]
[null,"QBI-332/YQ","FORCELLA FEMMINA CON SNODO SGS/M16X1.5","Messina",16,"2014-09-22"]
[null,"OQJ-149/CP","KIT COMPLETO GUARNIZIONI CILINDRO 125","Messina",8,"2014-09-28"]
[null,"HOU-335/QO","VALVOLA DI RITEGNO PILOTATA   Z2FS 16-3X/S2","Roma",12,"2014-09-30"]
[null,"RVG-263/JX","SERVOVALVOLA CON ROTORE DINAMICO","Brescia",12,"2014-10-08"]
[null,"FRF-171/ZE","KIT GUARNIZIONI LC25...6X/LC25DB/DR-5X","Firenze",18,"2014-10-16"]
[null,"FRF-171/ZE","KIT GUARNIZIONI LC25...6X/LC25DB/DR-5X","Brescia",16,"2014-10-22"]
[null,"KWO-343/SK","VITI TCCEI 12.9 UNI 5931 BR. M20 X 140","Firenze",12,"2014-10-28"]
[null,"IGF-330/RW","RUOTE 65 SERIE RINFORZATA CON FRENO","Milano",14,"2014-11-01"]
[null,"EVW-340/RN","OLFLEX FD CLASSIC 810 CY 4G0,5","Brescia",8,"2014-11-09"]
[null,"OQJ-149/CP","KIT COMPLETO GUARNIZIONI CILINDRO 125","Firenze",4,"2014-11-13"]
[null,"LBW-277/ME","KIT COMPLETO GUARNIZIONI PER CILINDRO 80","Messina",8,"2014-11-20"]
[null,"KWO-343/SK","VITI TCCEI 12.9 UNI 5931 BR. M20 X 140","Milano",18,"2014-11-26"]
[null,"RVA-370/MO","ELEMENTO LOGICO LC 40 DB20E7X/","Messina",14,"2014-12-04"]
[null,"BVD-350/EJ","CARTUCCIA FILTRO DA 8 MICRON","Brescia",4,"2014-12-12"]

{"sheet":"Toty","index":3,"n_rows":64,"n_cols":15,"rows_kept":64,"cut":false,"hidden":false,"merged":[]}
[null,"TABELLA ARTICOLI PRELEVATI NEL 2014 DAI DIVERSI MAGAZZINI",null,null,null,null,null,null,null,"TABELLA ARTICOLI PRELEVATI NEL 2014 E SUDDIVISI PER TRIMESTRE"]
[]
[null,"COD. ART.","DESCRIZIONE ARTICOLO","SEDE","Q.TA' prelevata","DATA",null,null,null,"SELEZIONARE IL MAGAZZINO : ","Milano"]
[null,"KWO-343/SK","VITI TCCEI 12.9 UNI 5931 BR. M20 X 140","Brescia",18,"2014-01-15"]
[null,"SGY-295/PG","PIGNONE SEMPL. 3/4 Z9\"","Milano",10,"2014-01-18",null,null,null,"Elenco Univoco Articoli","I° TRIM.","II° TRIM.","III° TRIM.","IV° TRIM","TOTALE"]
[null,"QBI-332/YQ","FORCELLA FEMMINA CON SNODO SGS/M16X1.5","Roma",6,"2014-01-25",null,null,null,"SGY-295/PG",10,null,null,null,{"$f":"SUM(K6:N6)","v":10}]
[null,"RVG-263/JX","SERVOVALVOLA CON ROTORE DINAMICO","Firenze",4,"2014-02-01",null,null,null,"BVD-350/EJ",null,4,null,null,{"$f":"SUM(K7:N7)","v":4}]
[null,"SGY-295/PG","PIGNONE SEMPL. 3/4 Z9\"","Roma",6,"2014-03-02",null,null,null,"NWC-213/WR",null,6,null,null,6]
[null,"OQJ-149/CP","KIT COMPLETO GUARNIZIONI CILINDRO 125","Firenze",10,"2014-02-11",null,null,null,"WTT-322/YR",null,14,null,null,14]
[null,"GTN-188/OI","VALVOLA RITEGNO A PIASTRA Z1S 10 P2-3X/V","Roma",4,"2014-02-16",null,null,null,"HYM-126/TJ",null,14,null,null,14]
[null,"KWO-343/SK","VITI TCCEI 12.9 UNI 5931 BR. M20 X 140","Brescia",12,"2014-02-23",null,null,null,"LCJ-304/BX",null,10,null,null,10]
[null,"IAB-347/TY","REGOLATORE DI FLUSSO Z2FS 10-3-3 X/ V","Roma",4,"2014-03-01",null,null,null,"GTN-188/OI",null,null,16,null,16]
[null,"SGY-295/PG","PIGNONE SEMPL. 3/4 Z9\"","Firenze",6,"2014-03-05",null,null,null,"LBW-277/ME",null,null,16,null,16]
[null,"OYZ-311/GH","COPERCHIO ELEMENTO LOGICO LFA 25 KWA-7X/","Firenze",4,"2014-03-10",null,null,null,"RVG-263/JX",null,null,16,null,16]
[null,"DBY-128/GN","AMMONIACA ANIDRA UN BOMBOLA DA KG.25","Brescia",14,"2014-03-18",null,null,null,"LCJ-304/BX",null,null,4,null,4]
[null,"KWO-343/SK","VITI TCCEI 12.9 UNI 5931 BR. M20 X 140","Firenze",16,"2014-03-23",null,null,null,"IGF-330/RW",null,null,null,14,14]
[null,"LCJ-304/BX","KIT REVISIONE CILINDRO M.W.","Brescia",16,"2014-03-26",null,null,null,"KWO-343/SK",null,null,null,18,18]
[null,"SYA-341/BM","PIGNONI SEMPLICI 3/4 Z21","Roma",14,"2014-03-31",null,null,null,null,null,null,null,null,0]
[null,"IGF-330/RW","RUOTE 65 SERIE RINFORZATA CON FRENO","Brescia",10,"2014-04-06",null,null,null,null,null,null,null,null,0]
[null,"BVD-350/EJ","CARTUCCIA FILTRO DA 8 MICRON","Milano",4,"2014-04-09",null,null,null,null,null,null,null,null,0]
[null,"EVW-340/RN","OLFLEX FD CLASSIC 810 CY 4G0,5","Firenze",8,"2014-04-16",null,null,null,null,null,null,null,null,0]
[null,"NWC-213/WR","KIT MAGNETE  M.W.","Milano",6,"2014-04-23",null,null,null,null,null,null,null,null,0]
[null,"WTT-322/YR","CURVA 45ｰ F.F. 1 ZINC.\"","Milano",14,"2014-04-30",null,null,null,null,null,null,null,null,0]
[null,"NWC-213/WR","KIT MAGNETE  M.W.","Messina",16,"2014-05-07",null,null,null,null,null,null,null,null,0]
[null,"SYA-341/BM","PIGNONI SEMPLICI 3/4 Z21","Roma",18,"2014-05-12",null,null,null,null,null,null,null,null,0]
[null,"OQJ-149/CP","KIT COMPLETO GUARNIZIONI CILINDRO 125","Roma",18,"2014-05-20",null,null,null,null,null,null,null,null,0]
[null,"SYA-341/BM","PIGNONI SEMPLICI 3/4 Z21","Roma",18,"2014-05-27",null,null,null,null,null,null,null,null,0]
[null,"OCI-162/XK","KIT COMPLETO GUARNIZIONI CILINDRO 80 CMPC","Brescia",18,"2014-05-30",null,null,null,null,null,null,null,null,{"$f":"SUM(K28:N28)","v":0}]
[null,"HYM-126/TJ","VALVOLA RIDUTTRICE DI PRESSIONE  DA 40 MBAR","Milano",14,"2014-06-05"]
[null,"LCJ-304/BX","KIT REVISIONE CILINDRO M.W.","Milano",10,"2014-06-11"]
[null,"RVG-263/JX","SERVOVALVOLA CON ROTORE DINAMICO","Messina",8,"2014-06-17"]
[null,"OQJ-149/CP","KIT COMPLETO GUARNIZIONI CILINDRO 125","Messina",16,"2014-06-25"]
[null,"DBY-128/GN","AMMONIACA ANIDRA UN BOMBOLA DA KG.25","Roma",8,"2014-06-28"]
[null,"SGY-295/PG","PIGNONE SEMPL. 3/4 Z9\"","Brescia",10,"2014-06-30"]
[null,"NWC-213/WR","KIT MAGNETE  M.W.","Messina",10,"2014-07-07"]
[null,"FRF-171/ZE","KIT GUARNIZIONI LC25...6X/LC25DB/DR-5X","Firenze",12,"2014-07-10"]
[null,"OCI-162/XK","KIT COMPLETO GUARNIZIONI CILINDRO 80 CMPC","Firenze",12,"2014-07-18"]
[null,"GTN-188/OI","VALVOLA RITEGNO A PIASTRA Z1S 10 P2-3X/V","Milano",16,"2014-07-24"]
[null,"RVA-370/MO","ELEMENTO LOGICO LC 40 DB20E7X/","Messina",6,"2014-07-29"]
[null,"EJJ-243/RK","OLFLEX FD CLASSIC 810 7G0,5","Roma",16,"2014-08-06"]
[null,"HYM-126/TJ","VALVOLA RIDUTTRICE DI PRESSIONE  DA 40 MBAR","Brescia",14,"2014-08-13"]
[null,"LBW-277/ME","KIT COMPLETO GUARNIZIONI PER CILINDRO 80","Milano",16,"2014-08-19"]
[null,"RVG-263/JX","SERVOVALVOLA CON ROTORE DINAMICO","Milano",16,"2014-08-22"]
[null,"OQJ-149/CP","KIT COMPLETO GUARNIZIONI CILINDRO 125","Roma",6,"2014-08-25"]
[null,"RVA-370/MO","ELEMENTO LOGICO LC 40 DB20E7X/","Brescia",14,"2014-08-30"]
[null,"DBY-128/GN","AMMONIACA ANIDRA UN BOMBOLA DA KG.25","Firenze",12,"2014-09-02"]
[null,"LCJ-304/BX","KIT REVISIONE CILINDRO M.W.","Milano",4,"2014-09-08"]
[null,"LCJ-304/BX","KIT REVISIONE CILINDRO M.W.","Messina",16,"2014-09-10"]
[null,"GTN-188/OI","VALVOLA RITEGNO A PIASTRA Z1S 10 P2-3X/V","Messina",18,"2014-09-14"]
[null,"OYZ-311/GH","COPERCHIO ELEMENTO LOGICO LFA 25 KWA-7X/","Roma",14,"2014-09-17"]
[null,"QBI-332/YQ","FORCELLA FEMMINA CON SNODO SGS/M16X1.5","Messina",16,"2014-09-22"]
[null,"OQJ-149/CP","KIT COMPLETO GUARNIZIONI CILINDRO 125","Messina",8,"2014-09-28"]
[null,"HOU-335/QO","VALVOLA DI RITEGNO PILOTATA   Z2FS 16-3X/S2","Roma",12,"2014-09-30"]
[null,"RVG-263/JX","SERVOVALVOLA CON ROTORE DINAMICO","Brescia",12,"2014-10-08"]
[null,"FRF-171/ZE","KIT GUARNIZIONI LC25...6X/LC25DB/DR-5X","Firenze",18,"2014-10-16"]
[null,"FRF-171/ZE","KIT GUARNIZIONI LC25...6X/LC25DB/DR-5X","Brescia",16,"2014-10-22"]
[null,"KWO-343/SK","VITI TCCEI 12.9 UNI 5931 BR. M20 X 140","Firenze",12,"2014-10-28"]
[null,"IGF-330/RW","RUOTE 65 SERIE RINFORZATA CON FRENO","Milano",14,"2014-11-01"]
[null,"EVW-340/RN","OLFLEX FD CLASSIC 810 CY 4G0,5","Brescia",8,"2014-11-09"]
[null,"OQJ-149/CP","KIT COMPLETO GUARNIZIONI CILINDRO 125","Firenze",4,"2014-11-13"]
[null,"LBW-277/ME","KIT COMPLETO GUARNIZIONI PER CILINDRO 80","Messina",8,"2014-11-20"]
[null,"KWO-343/SK","VITI TCCEI 12.9 UNI 5931 BR. M20 X 140","Milano",18,"2014-11-26"]
[null,"RVA-370/MO","ELEMENTO LOGICO LC 40 DB20E7X/","Messina",14,"2014-12-04"]
[null,"BVD-350/EJ","CARTUCCIA FILTRO DA 8 MICRON","Brescia",4,"2014-12-12"]